BDBM471705 US10829438, Example 1G::US11174219, Example 1G
SMILES CC(=O)OCOn1nnc2ccc(cc12)C(=O)N[C@@H](C[C@@H](O)C(O)=O)Cc1ccc(cc1)-c1cccc(Cl)c1
InChI Key InChIKey=VYNVQXHMNWXYAL-RCZVLFRGSA-N
Data  2 KI
  Tab Delimited (TSV)   2D SDfile   Computed 3D by Vconf -m prep SDfile
Find this compound or compounds like it in BindingDB:
Activity Spreadsheet -- Enzyme Inhibition Constant Data from BindingDB
Found 2 hits for monomerid = 471705
LigandPNGBDBM471705(US10829438, Example 1G | US11174219, Example 1G)
Affinity DataKi: <1nM. Assay description: The assays were performed in 384-well white opaque plates at 37° C. using the fluorogenic peptide substrates at a concentration of 10 μM in Assa...
Ligand InfoKEGGPC cidPC sid
In DepthDetails US Patent
LigandPNGBDBM471705(US10829438, Example 1G | US11174219, Example 1G)
Affinity DataKi: <1nM. Assay description: The assays were performed in 384-well white opaque plates at 37° C. using the fluorogenic peptide substrates at a concentration of 10 μM in Assa...
Ligand InfoKEGGPC cidPC sid
In DepthDetails US Patent