BDBM471709 US10829438, Example 1I::US11174219, Example 1I
SMILES O[C@H](C[C@@H](Cc1ccc(cc1)-c1cccc(Cl)c1)NC(=O)c1ccc2nnn(OCc3ccccc3)c2c1)C(O)=O
InChI Key InChIKey=NKTBYQHQUNEYTN-GGXMVOPNSA-N
Data  2 KI
  Tab Delimited (TSV)   2D SDfile   Computed 3D by Vconf -m prep SDfile
Find this compound or compounds like it in BindingDB:
Activity Spreadsheet -- Enzyme Inhibition Constant Data from BindingDB
Found 2 hits for monomerid = 471709
LigandPNGBDBM471709(US10829438, Example 1I | US11174219, Example 1I)
Affinity DataKi:  35.5nM. Assay description: The assays were performed in 384-well white opaque plates at 37° C. using the fluorogenic peptide substrates at a concentration of 10 μM in Assa...
Ligand InfoKEGGPC cidPC sid
In DepthDetails US Patent
LigandPNGBDBM471709(US10829438, Example 1I | US11174219, Example 1I)
Affinity DataKi:  35.5nM. Assay description: The assays were performed in 384-well white opaque plates at 37° C. using the fluorogenic peptide substrates at a concentration of 10 μM in Assa...
Ligand InfoKEGGPC cidPC sid
In DepthDetails US Patent