BDBM471736 5-cyclopropyl-5- [3-[4-(3,4- difluoro-5- methoxy- phenyl)piperazin- 1-yl]-3-oxo- propyl] imidazolidine- 2,4-dione::US10829478, Compound 18
SMILES COc1cc(cc(F)c1F)N1CCN(CC1)C(=O)CCC1(NC(=O)NC1=O)C1CC1
InChI Key InChIKey=VHKRAQGLEXBWDL-UHFFFAOYSA-N
Data  9 IC50
  Tab Delimited (TSV)   2D SDfile   Computed 3D by Vconf -m prep SDfile
Find this compound or compounds like it in BindingDB:
Activity Spreadsheet -- Enzyme Inhibition Constant Data from BindingDB
Found 9 hits for monomerid = 471736
TargetA disintegrin and metalloproteinase with thrombospondin motifs 4(Homo sapiens (Human))
Galapagos
US Patent
LigandPNGBDBM471736(5-cyclopropyl-5- [3-[4-(3,4- difluoro-5- methoxy- ...)
Affinity DataIC50: >1.00E+4nM. Assay description: TABLE VI: The basis for the assay is the cleavage of the substrate TBIS-1 (5 FAM-TEGEARGSVILLK (5TAMRA)K-NH2) (SEQ ID NO: 2) by human ADAMTS4.For the...
Ligand InfoPC cidPC sid
In DepthDetails US Patent
TargetADAMTS5(Rattus norvegicus (Rat))
Galapagos
US Patent
LigandPNGBDBM471736(5-cyclopropyl-5- [3-[4-(3,4- difluoro-5- methoxy- ...)
Affinity DataIC50: >1.00E+4nM. Assay description: TABLE VII: The basis for the assay is the cleavage of the substrate TBIS-1 (5 FAM-TEGEARGSVILLK (5TAMRA)K-NH2) (SEQ ID NO: 2) by rnADAMTS-5 (1-564-6H...
Ligand InfoPC cidPC sid
In DepthDetails US Patent
TargetA disintegrin and metalloproteinase with thrombospondin motifs 5(Homo sapiens (Human))
Galapagos
US Patent
LigandPNGBDBM471736(5-cyclopropyl-5- [3-[4-(3,4- difluoro-5- methoxy- ...)
Affinity DataIC50:  75nM. Assay description: TABLE VIII: The basis for the assay is the cleavage of the substrate TBIS-1 (5 FAM-TEGEARGSVILLK (5TAMRA)K-NH2) (SEQ ID NO: 2) by human ADAMTS-5.For ...
Ligand InfoPC cidPC sid
In DepthDetails US Patent
TargetA disintegrin and metalloproteinase with thrombospondin motifs 5(Homo sapiens (Human))
Galapagos
US Patent
LigandPNGBDBM471736(5-cyclopropyl-5- [3-[4-(3,4- difluoro-5- methoxy- ...)
Affinity DataIC50:  75nM. Assay description: TABLE IX: The basis for the assay is the cleavage of the substrate TBIS-1 (5 FAM-TEGEARGSVILLK (5TAMRA)K-NH2) (SEQ ID NO: 2) by human ADAMTS-5.For th...
Ligand InfoPC cidPC sid
In DepthDetails US Patent
TargetMatrix metalloproteinase-14(Homo sapiens (Human))
Galapagos
US Patent
LigandPNGBDBM471736(5-cyclopropyl-5- [3-[4-(3,4- difluoro-5- methoxy- ...)
Affinity DataIC50: >1.00E+4nM. Assay description: TABLE XIII: The basis for the assay is the cleavage of the substrate 390 MMP FRET Substrate I (Anaspec Cat #AS-27076) by human MMP13 (Enzo Life Scien...
Ligand InfoPC cidPC sid
In DepthDetails US Patent
TargetDisintegrin and metalloproteinase domain-containing protein 17(Homo sapiens (Human))
Galapagos
US Patent
LigandPNGBDBM471736(5-cyclopropyl-5- [3-[4-(3,4- difluoro-5- methoxy- ...)
Affinity DataIC50: >1.00E+4nM. Assay description: TABLE XI: The basis for the assay is the cleavage of the substrate 5FAM-LAQAVRSSSRK-5TAMRA (SEQ ID NO: 3) (Anaspec, custom 34891) by human TACE (R&D ...
Ligand InfoPC cidPC sid
In DepthDetails US Patent
TargetCollagenase 3(Homo sapiens (Human))
Galapagos
US Patent
LigandPNGBDBM471736(5-cyclopropyl-5- [3-[4-(3,4- difluoro-5- methoxy- ...)
Affinity DataIC50: >1.00E+4nM. Assay description: TABLE XII: The basis for the assay is the cleavage of the substrate 390 MMP FRET Substrate I (Anaspec Cat #AS-27076) by human MMP13 (Chemicon, Cat #C...
Ligand InfoPC cidPC sid
In DepthDetails US Patent
TargetCollagenase 3(Homo sapiens (Human))
Galapagos
US Patent
LigandPNGBDBM471736(5-cyclopropyl-5- [3-[4-(3,4- difluoro-5- methoxy- ...)
Affinity DataIC50: >1.00E+4nM. Assay description: TABLE XII: The basis for the assay is the cleavage of the substrate 390 MMP FRET Substrate I (Anaspec Cat #AS-27076) by human MMP13 (Chemicon, Cat #C...
Ligand InfoPC cidPC sid
In DepthDetails US Patent
LigandPNGBDBM471736(5-cyclopropyl-5- [3-[4-(3,4- difluoro-5- methoxy- ...)
Affinity DataIC50:  12.5nM. Assay description: TABLE X: The IC50 value for test compounds can be determined in a fluorescent based protease assay.The basis for the assay is the cleavage of the sub...
Ligand InfoPC cidPC sid
In DepthDetails US Patent