BDBM471751 N4-(3-Chloro-4-methoxyphenyl)-5-fluoro-N2-[3-[(N-methylamino)carbonylmethyleneoxy]phenyl]-2,4-pyrimidinediamine::US10828301, Compound R926891
SMILES CNC(=O)COc1cccc(Nc2ncc(F)c(Nc3ccc(OC)c(Cl)c3)n2)c1
InChI Key InChIKey=YNMOPYBSNMFKSH-UHFFFAOYSA-N
Data  1 IC50
  Tab Delimited (TSV)   2D SDfile   Computed 3D by Vconf -m prep SDfile
Find this compound or compounds like it in BindingDB:
Activity Spreadsheet -- Enzyme Inhibition Constant Data from BindingDB
Found 1 hit for monomerid = 471751
TargetTyrosine-protein kinase SYK(Homo sapiens (Human))
Rigel Pharmceuticals
US Patent
LigandPNGBDBM471751(N4-(3-Chloro-4-methoxyphenyl)-5-fluoro-N2-[3-[(N-m...)
Affinity DataIC50:  170nM. Assay description: Several 2,4-pyrimidinediamine compounds were tested for the ability to inhibit Syk kinase catalyzed phosphorylation of a peptide substrate in a bioch...
Ligand InfoPC cidPC sid
In DepthDetails US Patent