BDBM471774 (R)-1-ethyl-N-(1-(4-(ethylsulfonyl)phenyl)-2- hydroxyethyl)-2-(5- (trifluoromethyl)picolinoyl)-1H-indole-5- carboxamide::US10829448, Compound IN-22
SMILES Cc1ccc(cc1)S(=O)(=O)n1c(cc2cc(Br)ccc12)C(O)c1ccc(cn1)C(F)(F)F
InChI Key InChIKey=UJZMYQBERAMRJH-UHFFFAOYSA-N
Data  1 KI
  Tab Delimited (TSV)   2D SDfile   Computed 3D by Vconf -m prep SDfile
Find this compound or compounds like it in BindingDB:
Activity Spreadsheet -- Enzyme Inhibition Constant Data from BindingDB
Found 1 hit for monomerid = 471774
TargetNuclear receptor ROR-gamma(Homo sapiens (Human))
Vitae Pharmaceuticals
US Patent
LigandPNGBDBM471774((R)-1-ethyl-N-(1-(4-(ethylsulfonyl)phenyl)-2- hydr...)
Affinity DataKi: <100nM. Assay description: Compounds described herein were tested for ability to bind to RORγ in a cell-free competition assay with commercially available radio-ligand (RL...
Ligand InfoPC cidPC sid
In DepthDetails US Patent