BDBM471812 1-ethyl-N-((S)-1-(4-(ethylsulfonyl)phenyl)-2- hydroxyethyl)-2-(((1r,4S)-4- (trifluoromethyl)cyclohexyl)methyl)-1H- benzo[d]imidazole-5-carboxamide::US10829448, Compound BE-24
SMILES CCn1c(CC2CCC(CC2)C(F)(F)F)nc2cc(ccc12)C(=O)N[C@H](CO)c1ccc(cc1)S(=O)(=O)CC
InChI Key InChIKey=XGCPKYNJGOYJCO-SXKUEDQZSA-N
Data  1 KI
  Tab Delimited (TSV)   2D SDfile   Computed 3D by Vconf -m prep SDfile
Find this compound or compounds like it in BindingDB:
Activity Spreadsheet -- Enzyme Inhibition Constant Data from BindingDB
Found 1 hit for monomerid = 471812
TargetNuclear receptor ROR-gamma(Homo sapiens (Human))
Vitae Pharmaceuticals
US Patent
LigandPNGBDBM471812(1-ethyl-N-((S)-1-(4-(ethylsulfonyl)phenyl)-2- hydr...)
Affinity DataKi:  550nM. Assay description: Compounds described herein were tested for ability to bind to RORγ in a cell-free competition assay with commercially available radio-ligand (RL...
Ligand InfoPC cidPC sid
In DepthDetails US Patent