BDBM471850 CIS-1-(Cyclobutyl-methyl)-8-dimethylamino-3-[(4-methylsulfonyl-phenyl)-methyl]- 8-phenyl-1,3-diazaspiro[4.5]decan-2-one::US10829480, Example SC_2001
SMILES CN(C)[C@]1(CC[C@]2(CN(Cc3ccc(cc3)S(C)(=O)=O)C(=O)N2CC2CCC2)CC1)c1ccccc1
InChI Key InChIKey=BARLHUVNIVYXMO-ISILISOKSA-N
Data  2 KI
  Tab Delimited (TSV)   2D SDfile   Computed 3D by Vconf -m prep SDfile
Find this compound or compounds like it in BindingDB:
Activity Spreadsheet -- Enzyme Inhibition Constant Data from BindingDB
Found 2 hits for monomerid = 471850
TargetMu-type opioid receptor(Homo sapiens (Human))
Gruenenthal
US Patent
LigandPNGBDBM471850(CIS-1-(Cyclobutyl-methyl)-8-dimethylamino-3-[(4-me...)
Affinity DataKi:  2.70nM. Assay description: Mu-Opioid Peptide (hMOP): The hMOP receptor binding assay was performed as homogeneous SPA-assay (scintillation proximity assay) using the assay buff...
Ligand InfoPC cidPC sid
In DepthDetails US Patent
TargetNociceptin receptor(Homo sapiens (Human))
Gruenenthal
US Patent
LigandPNGBDBM471850(CIS-1-(Cyclobutyl-methyl)-8-dimethylamino-3-[(4-me...)
Affinity DataKi:  245nM. Assay description: The hNOP receptor binding assay was performed as homogeneous SPA-assay (scintillation proximity assay) using the assay buffer 50 mM TRIS-HCl. 10 mM M...
Ligand InfoPC cidPC sid
In DepthDetails US Patent