BDBM471856 US10829446, Compound 98
SMILES O=C(NNS(=O)(=O)c1ccc2ccccc2c1)c1cccc(c1)-c1cccnc1
InChI Key InChIKey=VOJUNAVICFXYHG-UHFFFAOYSA-N
Data  1 IC50
  Tab Delimited (TSV)   2D SDfile   Computed 3D by Vconf -m prep SDfile
Find this compound or compounds like it in BindingDB:
Activity Spreadsheet -- Enzyme Inhibition Constant Data from BindingDB
Found 1 hit for monomerid = 471856
TargetHistone acetyltransferase KAT6A [507-778](Homo sapiens)
Monash University
US Patent
LigandPNGBDBM471856(US10829446, Compound 98)
Affinity DataIC50:  1.31E+4nM. Assay description: Active Moz protein was expressed as N-terminal fusion protein with a His6 tag in BL21 E. coli cells. Protein purification was performed via nickel-im...
Ligand InfoPC cidPC sid
In DepthDetails US Patent