BDBM471972 (5R)-5-[3-[(3S)- 4-(4,5-dichloro-2- methoxy-phenyl)- 3-methyl- piperazin- 1-yl]-3-oxo- propyl]-5-methyl- imidazolidine- 2,4-dione::US10829478, Compound 92
SMILES COc1cc(Cl)c(Cl)cc1N1CCN(C[C@@H]1C)C(=O)CC[C@@]1(C)NC(=O)NC1=O
InChI Key InChIKey=XVVCQNUKHZQYIZ-JEOXALJRSA-N
Data  1 IC50
  Tab Delimited (TSV)   2D SDfile   Computed 3D by Vconf -m prep SDfile
Find this compound or compounds like it in BindingDB:
Activity Spreadsheet -- Enzyme Inhibition Constant Data from BindingDB
Found 1 hit for monomerid = 471972
LigandPNGBDBM471972((5R)-5-[3-[(3S)- 4-(4,5-dichloro-2- methoxy-phenyl...)
Affinity DataIC50:  12.5nM. Assay description: TABLE X: The IC50 value for test compounds can be determined in a fluorescent based protease assay.The basis for the assay is the cleavage of the sub...
Ligand InfoPC cidPC sid
In DepthDetails US Patent