BDBM472015 CIS-8-Dimethylamino-1-[(1-hydroxy-cyclobutyl)-methyl]-3-[(3-methoxyphenyl)- methyl]-8-phenyl-1,3-diazaspiro[4.5]decan-2-one::US10829480, Example SC_2022
SMILES COc1cccc(CN2C[C@]3(CC[C@@](CC3)(N(C)C)c3ccccc3)N(CC3(O)CCC3)C2=O)c1
InChI Key InChIKey=BDSLZNQEPZAZFZ-JSEFLNQRSA-N
Data  2 KI
  Tab Delimited (TSV)   2D SDfile   Computed 3D by Vconf -m prep SDfile
Find this compound or compounds like it in BindingDB:
Activity Spreadsheet -- Enzyme Inhibition Constant Data from BindingDB
Found 2 hits for monomerid = 472015
TargetMu-type opioid receptor(Homo sapiens (Human))
Gruenenthal
US Patent
LigandPNGBDBM472015(CIS-8-Dimethylamino-1-[(1-hydroxy-cyclobutyl)-meth...)
Affinity DataKi:  5.40nM. Assay description: Mu-Opioid Peptide (hMOP): The hMOP receptor binding assay was performed as homogeneous SPA-assay (scintillation proximity assay) using the assay buff...
Ligand InfoPC cidPC sid
In DepthDetails US Patent
TargetNociceptin receptor(Homo sapiens (Human))
Gruenenthal
US Patent
LigandPNGBDBM472015(CIS-8-Dimethylamino-1-[(1-hydroxy-cyclobutyl)-meth...)
Affinity DataKi:  420nM. Assay description: The hNOP receptor binding assay was performed as homogeneous SPA-assay (scintillation proximity assay) using the assay buffer 50 mM TRIS-HCl. 10 mM M...
Ligand InfoPC cidPC sid
In DepthDetails US Patent