BDBM472048 CIS-8-Dimethylamino-3-[(4-methoxyphenyl)-methyl]-1-[(1-methyl-cyclobutyl)- methyl]-8-phenyl-1,3-diazaspiro[4.5]decan-2-one::US10829480, Example SC_2069
SMILES COc1ccc(CN2C[C@]3(CC[C@@](CC3)(N(C)C)c3ccccc3)N(CC3(C)CCC3)C2=O)cc1
InChI Key InChIKey=RHAGFGQMVKOAOQ-RNPORBBMSA-N
Data  2 KI
  Tab Delimited (TSV)   2D SDfile   Computed 3D by Vconf -m prep SDfile
Find this compound or compounds like it in BindingDB:
Activity Spreadsheet -- Enzyme Inhibition Constant Data from BindingDB
Found 2 hits for monomerid = 472048
TargetMu-type opioid receptor(Homo sapiens (Human))
Gruenenthal
US Patent
LigandPNGBDBM472048(CIS-8-Dimethylamino-3-[(4-methoxyphenyl)-methyl]-1...)
Affinity DataKi:  14nM. Assay description: Mu-Opioid Peptide (hMOP): The hMOP receptor binding assay was performed as homogeneous SPA-assay (scintillation proximity assay) using the assay buff...
Ligand InfoPC cidPC sid
In DepthDetails US Patent
TargetNociceptin receptor(Homo sapiens (Human))
Gruenenthal
US Patent
LigandPNGBDBM472048(CIS-8-Dimethylamino-3-[(4-methoxyphenyl)-methyl]-1...)
Affinity DataKi:  675nM. Assay description: The hNOP receptor binding assay was performed as homogeneous SPA-assay (scintillation proximity assay) using the assay buffer 50 mM TRIS-HCl. 10 mM M...
Ligand InfoPC cidPC sid
In DepthDetails US Patent