BDBM472253 1-((2,2-difluorobenzo[d][1,3]dioxol-4-yl)methyl)-N-((1-((2-::US10829481, Compound I-75
SMILES CNC(=O)CS(=O)(=O)N1CCC(CNC(=O)c2ccc3n(Cc4cccc5OC(F)(F)Oc45)c(nc3c2)C(F)(F)F)CC1
InChI Key InChIKey=LLLBAHOKCNPBOC-UHFFFAOYSA-N
Data  1 KI
  Tab Delimited (TSV)   2D SDfile   Computed 3D by Vconf -m prep SDfile
Find this compound or compounds like it in BindingDB:
Activity Spreadsheet -- Enzyme Inhibition Constant Data from BindingDB
Found 1 hit for monomerid = 472253
TargetNuclear receptor ROR-gamma(Homo sapiens (Human))
Vitae Pharmaceuticals
US Patent
LigandPNGBDBM472253(1-((2,2-difluorobenzo[d][1,3]dioxol-4-yl)methyl)-N...)
Affinity DataKi: <100nM. Assay description: Compounds described herein were tested for ability to bind to RORγ in a cell-free competition assay with commercially available radio-ligand (RL...
Ligand InfoPC cidPC sid
In DepthDetails US Patent