BDBM472295 2-cyclopropyl-N-(4-(ethylsulfonyl)benzyl)-1-((1-(2,2,2-trifluoroethyl)-::US10829481, Compound I-111
SMILES CCS(=O)(=O)c1ccc(CNC(=O)c2ccc3n(Cc4cnn(CC(F)(F)F)c4)c(nc3c2)C2CC2)cc1
InChI Key InChIKey=CSAKJHYJSSPCPZ-UHFFFAOYSA-N
Data  1 KI
  Tab Delimited (TSV)   2D SDfile   Computed 3D by Vconf -m prep SDfile
Find this compound or compounds like it in BindingDB:
Activity Spreadsheet -- Enzyme Inhibition Constant Data from BindingDB
Found 1 hit for monomerid = 472295
TargetNuclear receptor ROR-gamma(Homo sapiens (Human))
Vitae Pharmaceuticals
US Patent
LigandPNGBDBM472295(2-cyclopropyl-N-(4-(ethylsulfonyl)benzyl)-1-((1-(2...)
Affinity DataKi: >1.00E+3nM. Assay description: Compounds described herein were tested for ability to bind to RORγ in a cell-free competition assay with commercially available radio-ligand (RL...
Ligand InfoPC cidPC sid
In DepthDetails US Patent