BDBM472345 N-(4-(ethylsulfonyl)benzyl)-1-((2-methyl-2H-indazol-4-yl)methyl)-2-::US10829481, Compound I-143
SMILES CCS(=O)(=O)c1ccc(CNC(=O)c2ccc3n(Cc4cccc5nn(C)cc45)c(nc3c2)C(F)(F)F)cc1
InChI Key InChIKey=YXYUDFSPCPLLHD-UHFFFAOYSA-N
Data  1 KI
  Tab Delimited (TSV)   2D SDfile   Computed 3D by Vconf -m prep SDfile
Find this compound or compounds like it in BindingDB:
Activity Spreadsheet -- Enzyme Inhibition Constant Data from BindingDB
Found 1 hit for monomerid = 472345
TargetNuclear receptor ROR-gamma(Homo sapiens (Human))
Vitae Pharmaceuticals
US Patent
LigandPNGBDBM472345(N-(4-(ethylsulfonyl)benzyl)-1-((2-methyl-2H-indazo...)
Affinity DataKi: <100nM. Assay description: Compounds described herein were tested for ability to bind to RORγ in a cell-free competition assay with commercially available radio-ligand (RL...
Ligand InfoPC cidPC sid
In DepthDetails US Patent