BDBM472359 N-(4-(ethylsulfonyl)benzyl)-1-((1-(2,2,2-trifluoroethyl)piperidin-4-::US10829481, Compound I-155
SMILES CCS(=O)(=O)c1ccc(CNC(=O)c2ccc3n(CC4CCN(CC(F)(F)F)CC4)c(nc3c2)C(F)(F)F)cc1
InChI Key InChIKey=HMSRYPVHKLQREP-UHFFFAOYSA-N
Data  1 KI
  Tab Delimited (TSV)   2D SDfile   Computed 3D by Vconf -m prep SDfile
Find this compound or compounds like it in BindingDB:
Activity Spreadsheet -- Enzyme Inhibition Constant Data from BindingDB
Found 1 hit for monomerid = 472359
TargetNuclear receptor ROR-gamma(Homo sapiens (Human))
Vitae Pharmaceuticals
US Patent
LigandPNGBDBM472359(N-(4-(ethylsulfonyl)benzyl)-1-((1-(2,2,2-trifluoro...)
Affinity DataKi:  550nM. Assay description: Compounds described herein were tested for ability to bind to RORγ in a cell-free competition assay with commercially available radio-ligand (RL...
Ligand InfoPC cidPC sid
In DepthDetails US Patent