BDBM472363 N-(4-(ethylsulfonyl)benzyl)-1-((1-(5-fluoropyrimidin-2-yl)piperidin-4-::US10829481, Compound I-158
SMILES CCS(=O)(=O)c1ccc(CNC(=O)c2ccc3n(CC4CCN(CC4)c4ncc(F)cn4)c(nc3c2)C(F)(F)F)cc1
InChI Key InChIKey=ROBKHMYMPMBRLK-UHFFFAOYSA-N
Data  1 KI
  Tab Delimited (TSV)   2D SDfile   Computed 3D by Vconf -m prep SDfile
Find this compound or compounds like it in BindingDB:
Activity Spreadsheet -- Enzyme Inhibition Constant Data from BindingDB
Found 1 hit for monomerid = 472363
TargetNuclear receptor ROR-gamma(Homo sapiens (Human))
Vitae Pharmaceuticals
US Patent
LigandPNGBDBM472363(N-(4-(ethylsulfonyl)benzyl)-1-((1-(5-fluoropyrimid...)
Affinity DataKi: <100nM. Assay description: Compounds described herein were tested for ability to bind to RORγ in a cell-free competition assay with commercially available radio-ligand (RL...
Ligand InfoPC cidPC sid
In DepthDetails US Patent