BDBM472580 US10829487, Example I-59
SMILES C[C@@H](Nc1nc(C)nc2cc(=O)n(cc12)C12CC(C1)C2)c1cccc2c1CCC2(F)F
InChI Key InChIKey=VSESPOILRXPQEM-IZCNLJRESA-N
Data  1 IC50
  Tab Delimited (TSV)   2D SDfile   Computed 3D by Vconf -m prep SDfile
Find this compound or compounds like it in BindingDB:
Activity Spreadsheet -- Enzyme Inhibition Constant Data from BindingDB
Found 1 hit for monomerid = 472580
TargetGTPase KRas [1-169,G12D]/Son of sevenless homolog 1 [564-1049]()
Boehringer Ingelheim International
US Patent
LigandPNGBDBM472580(US10829487, Example I-59)
Affinity DataIC50:  3nM. Assay description: Compounds are diluted to a final start concentration of 100 μM and are tested in duplicate. Assay-ready plates (ARPs) are generated using an Acc...
Ligand InfoPC cidPC sid
In DepthDetails US Patent