BDBM472686 US10836720, HIJ-1083
SMILES NC(=N)NCCCCCC(=O)NC[C@H](NC(=O)[C@@H]1CCCN1S(=O)(=O)c1ccccc1)C(O)=O
InChI Key InChIKey=ZJLLVRHQFNOZTN-IRXDYDNUSA-N
Data  5 IC50
  Tab Delimited (TSV)   2D SDfile   Computed 3D by Vconf -m prep SDfile
Find this compound or compounds like it in BindingDB:
Activity Spreadsheet -- Enzyme Inhibition Constant Data from BindingDB
Found 5 hits for monomerid = 472686
TargetIntegrin alpha-V/beta-1(Homo sapiens (Human))
The Regents Of The University Of California
US Patent
LigandPNGBDBM472686(US10836720, HIJ-1083)
Affinity DataIC50:  5.05E+3nM. Assay description: The blockade of integrin alpha 5 beta 1 provides a novel target for the treatment of asthma. As shown in FIGS. 1A and 1B, delivery of ATN-161, a low ...
Ligand InfoPC cidPC sid
In DepthDetails US Patent
TargetIntegrin alpha-V/beta-1(Homo sapiens (Human))
The Regents Of The University Of California
US Patent
LigandPNGBDBM472686(US10836720, HIJ-1083)
Affinity DataIC50:  5.05E+3nM. Assay description: The blockade of integrin alpha 5 beta 1 provides a novel target for the treatment of asthma. As shown in FIGS. 1A and 1B, delivery of ATN-161, a low ...
Ligand InfoPC cidPC sid
In DepthDetails US Patent
TargetIntegrin alpha-V/beta-3(Homo sapiens (Human))
University Of California San Francisco
Curated by ChEMBL
LigandPNGBDBM472686(US10836720, HIJ-1083)
Affinity DataIC50:  1.00E+4nM. Assay description: Inhibition of alphavbeta3 integrin (unknown origin) expressed in human SW480 cells transfected with human beta3 assessed as inhibition of cell adhesi...
Ligand InfoPC cidPC sid
In DepthDetails ArticlePubMed
TargetIntegrin alpha-V/beta-1(Homo sapiens (Human))
The Regents Of The University Of California
US Patent
LigandPNGBDBM472686(US10836720, HIJ-1083)
Affinity DataIC50:  316nM. Assay description: Inhibition of alphavbeta1 integrin (unknown origin) expressed in CHO cells assessed as inhibition of cell adhesion to fibronectin incubated for 60 mi...
Ligand InfoPC cidPC sid
In DepthDetails ArticlePubMed
TargetIntegrin alpha-5/beta-1(Homo sapiens (Human))
University Of California San Francisco
Curated by ChEMBL
LigandPNGBDBM472686(US10836720, HIJ-1083)
Affinity DataIC50:  830nM. Assay description: Inhibition of alpha5beta1 integrin in human SW480 cells assessed as inhibition of cell adhesion to fibronectin incubated for 60 mins by crystal viole...
Ligand InfoPC cidPC sid
In DepthDetails ArticlePubMed