BDBM472692 US10836720, HIJ-1204
SMILES NC(=N)Nc1cccc(c1)C(=O)NCC(=O)NC[C@H](NC(=O)C1C2CCC(CC2)N1S(=O)(=O)c1ccccc1)C(O)=O
InChI Key InChIKey=TZIAXVZQEBTCKV-BLPZBGMVSA-N
Data  2 IC50
  Tab Delimited (TSV)   2D SDfile   Computed 3D by Vconf -m prep SDfile
Find this compound or compounds like it in BindingDB:
Activity Spreadsheet -- Enzyme Inhibition Constant Data from BindingDB
Found 2 hits for monomerid = 472692
TargetIntegrin alpha-V/beta-1(Homo sapiens (Human))
The Regents Of The University Of California
US Patent
LigandPNGBDBM472692(US10836720, HIJ-1204)
Affinity DataIC50: <100nM. Assay description: The blockade of integrin alpha 5 beta 1 provides a novel target for the treatment of asthma. As shown in FIGS. 1A and 1B, delivery of ATN-161, a low ...
Ligand InfoPC cidPC sid
In DepthDetails US Patent
TargetIntegrin alpha-V/beta-1(Homo sapiens (Human))
The Regents Of The University Of California
US Patent
LigandPNGBDBM472692(US10836720, HIJ-1204)
Affinity DataIC50: >1.00E+4nM. Assay description: The blockade of integrin alpha 5 beta 1 provides a novel target for the treatment of asthma. As shown in FIGS. 1A and 1B, delivery of ATN-161, a low ...
Ligand InfoPC cidPC sid
In DepthDetails US Patent