BDBM472741 (R)-2-amino-N-(tert-butoxy)-5-(2-(2,5-difluorophenyl)pyrrolidin-1-yl)pyrazolo[1,5-c]pyrimidine-3-carboxamide::US10829492, Example 18
SMILES CC(C)(C)ONC(=O)c1c(N)nn2ccc(nc12)N1CCC[C@@H]1c1cc(F)ccc1F
InChI Key InChIKey=HGLNEOSHJNPWMH-OAHLLOKOSA-N
Data  1 IC50
  Tab Delimited (TSV)   2D SDfile   Computed 3D by Vconf -m prep SDfile
Find this compound or compounds like it in BindingDB:
Activity Spreadsheet -- Enzyme Inhibition Constant Data from BindingDB
Found 1 hit for monomerid = 472741
TargetHigh affinity nerve growth factor receptor(Homo sapiens (Human))
Chia Tai Tianqing Pharmaceutical Group
US Patent
LigandPNGBDBM472741((R)-2-amino-N-(tert-butoxy)-5-(2-(2,5-difluorophen...)
Affinity DataIC50: <1nM. Assay description: TrkA, TrkB and TrkC:A testing platform for TrkA, TrkB and TrkC kinase activity was established based on Homogeneous Time-Resolved Fluorescence (HTRF)...
Ligand InfoPC cidPC sid
In DepthDetails US Patent