BDBM472744 (R)-5-(2-(2,5-difluorophenyl)pyrrolidin-1-yl)-2-(methylamino)pyrazolo[1,5-a]pyrimidine-3-carboxamide::US10829492, Example 21
SMILES CNc1nn2ccc(nc2c1C(N)=O)N1CCC[C@@H]1c1cc(F)ccc1F
InChI Key InChIKey=OSAZEZGGLVPHDI-CYBMUJFWSA-N
Data  1 IC50
  Tab Delimited (TSV)   2D SDfile   Computed 3D by Vconf -m prep SDfile
Find this compound or compounds like it in BindingDB:
Activity Spreadsheet -- Enzyme Inhibition Constant Data from BindingDB
Found 1 hit for monomerid = 472744
TargetHigh affinity nerve growth factor receptor(Homo sapiens (Human))
Chia Tai Tianqing Pharmaceutical Group
US Patent
LigandPNGBDBM472744((R)-5-(2-(2,5-difluorophenyl)pyrrolidin-1-yl)-2-(m...)
Affinity DataIC50: <500nM. Assay description: TrkA, TrkB and TrkC:A testing platform for TrkA, TrkB and TrkC kinase activity was established based on Homogeneous Time-Resolved Fluorescence (HTRF)...
Ligand InfoPC cidPC sid
In DepthDetails US Patent