BDBM472748 (R)-5-(2-(2,5-difluorophenyl)pyrrolidin-1-yl)pyrazolo[1,5-c]pyrimidin-2-amine::US10829492, Example 25
SMILES Nc1cc2nc(ccn2n1)N1CCC[C@@H]1c1cc(F)ccc1F
InChI Key InChIKey=LRYFLXCAOAMPRO-CYBMUJFWSA-N
Data  1 IC50
  Tab Delimited (TSV)   2D SDfile   Computed 3D by Vconf -m prep SDfile
Find this compound or compounds like it in BindingDB:
Activity Spreadsheet -- Enzyme Inhibition Constant Data from BindingDB
Found 1 hit for monomerid = 472748
TargetHigh affinity nerve growth factor receptor(Homo sapiens (Human))
Chia Tai Tianqing Pharmaceutical Group
US Patent
LigandPNGBDBM472748((R)-5-(2-(2,5-difluorophenyl)pyrrolidin-1-yl)pyraz...)
Affinity DataIC50: <25nM. Assay description: TrkA, TrkB and TrkC:A testing platform for TrkA, TrkB and TrkC kinase activity was established based on Homogeneous Time-Resolved Fluorescence (HTRF)...
Ligand InfoPC cidPC sid
In DepthDetails US Patent