BDBM472781 US10829493, Example 7
SMILES Nc1ncnn2cc(cc12)-c1cnn(c1)C1COC1
InChI Key InChIKey=YMISILATXQDHGH-UHFFFAOYSA-N
Data  2 IC50  1 Kd
  Tab Delimited (TSV)   2D SDfile   Computed 3D by Vconf -m prep SDfile
Find this compound or compounds like it in BindingDB:
Activity Spreadsheet -- Enzyme Inhibition Constant Data from BindingDB
Found 3 hits for monomerid = 472781
TargetMast/stem cell growth factor receptor Kit [D816V](Homo sapiens (Human))
Blueprint Medicines
US Patent
LigandPNGBDBM472781(US10829493, Example 7)
Affinity DataIC50: <0.300nM. Assay description: PDGFRα (D842V):PDGFRα D842V assay at the apparent Michaelis-Menten constant(APPKM) for ATP: In each well of a 384-well assay plate, 7 nM of...
Ligand InfoPC cidPC sid
In DepthDetails US Patent
TargetMast/stem cell growth factor receptor Kit(Homo sapiens (Human))
Blueprint Medicines
US Patent
LigandPNGBDBM472781(US10829493, Example 7)
Affinity DataKd:  12.5nM. Assay description: Kd Determinations. For most assays, including wt KIT kinase, kinase-tagged T7 phage strains were prepared in an E. coli host derived from the BL21 st...
Ligand InfoPC cidPC sid
In DepthDetails US Patent
TargetPlatelet-derived growth factor receptor alpha [D842V](Homo sapiens (Human))
Blueprint Medicines
US Patent
LigandPNGBDBM472781(US10829493, Example 7)
Affinity DataIC50: <0.300nM. Assay description: KIT D816V assay at the APPKM for ATP: In each well of a 384-well assay plate, 0.3 nM of untreated enzyme was incubated in a total of 13 μL of bu...
Ligand InfoPC cidPC sid
In DepthDetails US Patent