BDBM472801 US10829496, Example 5
SMILES COc1nc2c(OC[C@@H]3CCC(=O)N3)csc2cc1C(N)=O
InChI Key InChIKey=GOGGJRZWBBJZNU-ZETCQYMHSA-N
Data  1 IC50
  Tab Delimited (TSV)   2D SDfile   Computed 3D by Vconf -m prep SDfile
Find this compound or compounds like it in BindingDB:
Activity Spreadsheet -- Enzyme Inhibition Constant Data from BindingDB
Found 1 hit for monomerid = 472801
TargetInterleukin-1 receptor-associated kinase 4(Homo sapiens (Human))
Bristol-Myers Squibb
US Patent
LigandPNGBDBM472801(US10829496, Example 5)
Affinity DataIC50:  20.3nM. Assay description: The assays were performed in U-bottom 384-well plates. The final assay volume was 30 μL prepared from 15 μL additions of enzyme and substra...
Ligand InfoPC cidPC sid
In DepthDetails US Patent