BDBM472804 US10829496, Example 8
SMILES CC[C@H]1[C@@H](COc2csc3cc(C(N)=O)c(OC)nc23)NC(=O)[C@@H]1F
InChI Key InChIKey=VCFPCGNQQWIFHX-LPBBDHJYSA-N
Data  1 IC50
  Tab Delimited (TSV)   2D SDfile   Computed 3D by Vconf -m prep SDfile
Find this compound or compounds like it in BindingDB:
Activity Spreadsheet -- Enzyme Inhibition Constant Data from BindingDB
Found 1 hit for monomerid = 472804
TargetInterleukin-1 receptor-associated kinase 4(Homo sapiens (Human))
Bristol-Myers Squibb
US Patent
LigandPNGBDBM472804(US10829496, Example 8)
Affinity DataIC50:  0.700nM. Assay description: The assays were performed in U-bottom 384-well plates. The final assay volume was 30 μL prepared from 15 μL additions of enzyme and substra...
Ligand InfoPC cidPC sid
In DepthDetails US Patent