BDBM472839 US10836742, Compound 10
SMILES Cc1cc(cn(C)c1=O)-c1ccc2CCC(=O)N(Cc3ccccn3)c2c1
InChI Key InChIKey=CVGMCZYEHNNSBC-UHFFFAOYSA-N
Data  1 IC50
  Tab Delimited (TSV)   2D SDfile   Computed 3D by Vconf -m prep SDfile
Find this compound or compounds like it in BindingDB:
Activity Spreadsheet -- Enzyme Inhibition Constant Data from BindingDB
Found 1 hit for monomerid = 472839
TargetBromodomain-containing protein 4 [49-170](Homo sapiens (Human))
Neomed Institute
US Patent
LigandPNGBDBM472839(US10836742, Compound 10)
Affinity DataIC50:  420nM. Assay description: To measure activity of bromodomain inhibitors, a His-epitope tagged BRD4 BD149-170 is purchased from BPS Bioscience. BRD4 binding and inhibition is a...
Ligand InfoPC cidPC sid
In DepthDetails US Patent