BDBM472854 Benzyl 4-fluoro-4-((trans-2-phenylcyclo- propyl)amino)methyl)piperidine-1- carboxylate::US10836743, Compound A1
SMILES FC1(CNC2CC2c2ccccc2)CCN(CC1)C(=O)OCc1ccccc1
InChI Key InChIKey=HVAHEEBZCZTWSZ-UHFFFAOYSA-N
Data  3 IC50
  Tab Delimited (TSV)   2D SDfile   Computed 3D by Vconf -m prep SDfile
Find this compound or compounds like it in BindingDB:
Activity Spreadsheet -- Enzyme Inhibition Constant Data from BindingDB
Found 3 hits for monomerid = 472854
TargetLysine-specific histone demethylase 1A(Homo sapiens (Human))
Shanghai Institute Of Material Medica, Chinese Academy Of Sciences
US Patent
LigandPNGBDBM472854(Benzyl 4-fluoro-4-((trans-2-phenylcyclo- propyl)am...)
Affinity DataIC50:  1.04nM. Assay description: Screening method: lysine-specific demethylase 1 (LSD1) activity screeningInstrument: microplate reader Envision™ (PerkinElmer, USA).MATERIALS: Human ...
Ligand InfoPC cidPC sid
In DepthDetails US Patent
TargetAmine oxidase [flavin-containing] B(Homo sapiens (Human))
Shanghai Institute Of Material Medica, Chinese Academy Of Sciences
US Patent
LigandPNGBDBM472854(Benzyl 4-fluoro-4-((trans-2-phenylcyclo- propyl)am...)
Affinity DataIC50: >1.00E+5nM. Assay description: Screening method: Monoamine oxidase MAOA and MAOB activity screeningInstrument: microplate reader Envision™ (PerkinElmer, USA).MATERIALS: Human recom...
Ligand InfoPC cidPC sid
In DepthDetails US Patent
TargetAmine oxidase [flavin-containing] A(Homo sapiens (Human))
Shanghai Institute Of Material Medica, Chinese Academy Of Sciences
US Patent
LigandPNGBDBM472854(Benzyl 4-fluoro-4-((trans-2-phenylcyclo- propyl)am...)
Affinity DataIC50: >1.00E+5nM. Assay description: Screening method: Monoamine oxidase MAOA and MAOB activity screeningInstrument: microplate reader Envision™ (PerkinElmer, USA).MATERIALS: Human recom...
Ligand InfoPC cidPC sid
In DepthDetails US Patent