BDBM472865 N-((4-fluoro-1-(piperidin-4-yl- methyl)piperidin-4-yl)methyl)- trans-2-phenylcyclopropylamine::US10836743, Compound A97
SMILES FC1(CNC2CC2c2ccccc2)CCN(Cc2ccncc2)CC1
InChI Key InChIKey=QPZRHEWJHNXZRF-UHFFFAOYSA-N
Data  1 IC50
  Tab Delimited (TSV)   2D SDfile   Computed 3D by Vconf -m prep SDfile
Find this compound or compounds like it in BindingDB:
Activity Spreadsheet -- Enzyme Inhibition Constant Data from BindingDB
Found 1 hit for monomerid = 472865
TargetLysine-specific histone demethylase 1A(Homo sapiens (Human))
Shanghai Institute Of Material Medica, Chinese Academy Of Sciences
US Patent
LigandPNGBDBM472865(N-((4-fluoro-1-(piperidin-4-yl- methyl)piperidin-4...)
Affinity DataIC50:  304nM. Assay description: Screening method: lysine-specific demethylase 1 (LSD1) activity screeningInstrument: microplate reader Envision™ (PerkinElmer, USA).MATERIALS: Human ...
Ligand InfoPC cidPC sid
In DepthDetails US Patent