BDBM472873 US10836743, Compound A101::tert-Butyl 4-((4-((2-(5-bromothien-2-yl)) cyclopropyl)amino)methyl)-4- fluoropiperidin-1-yl)methyl) benzoate
SMILES CC(C)(C)OC(=O)c1ccc(CN2CCC(F)(CNC3CC3c3ccc(Br)s3)CC2)cc1
InChI Key InChIKey=MMNWSZQPQRXTSW-UHFFFAOYSA-N
Data  1 IC50
  Tab Delimited (TSV)   2D SDfile   Computed 3D by Vconf -m prep SDfile
Find this compound or compounds like it in BindingDB:
Activity Spreadsheet -- Enzyme Inhibition Constant Data from BindingDB
Found 1 hit for monomerid = 472873
TargetLysine-specific histone demethylase 1A(Homo sapiens (Human))
Shanghai Institute Of Material Medica, Chinese Academy Of Sciences
US Patent
LigandPNGBDBM472873(US10836743, Compound A101 | tert-Butyl 4-((4-((2-(...)
Affinity DataIC50:  532nM. Assay description: Screening method: lysine-specific demethylase 1 (LSD1) activity screeningInstrument: microplate reader Envision™ (PerkinElmer, USA).MATERIALS: Human ...
Ligand InfoPC cidPC sid
In DepthDetails US Patent