BDBM472881 US10836743, Compound A105::tert-Butyl 4-((4-fluoro-4-(((2-(5-(4-fluoro- phenyl)thiophen-2-yl)cyclo- propyl)amino)methyl)piperidin- 1-yl)methyl)benzoate
SMILES CC(C)(C)OC(=O)c1ccc(CN2CCC(F)(CNC3CC3c3ccc(s3)-c3ccc(F)cc3)CC2)cc1
InChI Key InChIKey=FJPNZAUSOFXLMR-UHFFFAOYSA-N
Data  1 IC50
  Tab Delimited (TSV)   2D SDfile   Computed 3D by Vconf -m prep SDfile
Find this compound or compounds like it in BindingDB:
Activity Spreadsheet -- Enzyme Inhibition Constant Data from BindingDB
Found 1 hit for monomerid = 472881
TargetLysine-specific histone demethylase 1A(Homo sapiens (Human))
Shanghai Institute Of Material Medica, Chinese Academy Of Sciences
US Patent
LigandPNGBDBM472881(US10836743, Compound A105 | tert-Butyl 4-((4-fluor...)
Affinity DataIC50:  207nM. Assay description: Screening method: lysine-specific demethylase 1 (LSD1) activity screeningInstrument: microplate reader Envision™ (PerkinElmer, USA).MATERIALS: Human ...
Ligand InfoPC cidPC sid
In DepthDetails US Patent