BDBM472884 N-((4-fluoro-1-methylpiperidin-4-yl) methyl)-trans-2-phenylcyclopropyl- amine::US10836743, Compound A15
SMILES CN1CCC(F)(CNC2CC2c2ccccc2)CC1
InChI Key InChIKey=GQKQDRRRNMYOJG-UHFFFAOYSA-N
Data  3 IC50
  Tab Delimited (TSV)   2D SDfile   Computed 3D by Vconf -m prep SDfile
Find this compound or compounds like it in BindingDB:
Activity Spreadsheet -- Enzyme Inhibition Constant Data from BindingDB
Found 3 hits for monomerid = 472884
TargetLysine-specific histone demethylase 1A(Homo sapiens (Human))
Shanghai Institute Of Material Medica, Chinese Academy Of Sciences
US Patent
LigandPNGBDBM472884(N-((4-fluoro-1-methylpiperidin-4-yl) methyl)-trans...)
Affinity DataIC50:  21.9nM. Assay description: Screening method: lysine-specific demethylase 1 (LSD1) activity screeningInstrument: microplate reader Envision™ (PerkinElmer, USA).MATERIALS: Human ...
Ligand InfoPC cidPC sid
In DepthDetails US Patent
TargetAmine oxidase [flavin-containing] B(Homo sapiens (Human))
Shanghai Institute Of Material Medica, Chinese Academy Of Sciences
US Patent
LigandPNGBDBM472884(N-((4-fluoro-1-methylpiperidin-4-yl) methyl)-trans...)
Affinity DataIC50: >1.00E+5nM. Assay description: Screening method: Monoamine oxidase MAOA and MAOB activity screeningInstrument: microplate reader Envision™ (PerkinElmer, USA).MATERIALS: Human recom...
Ligand InfoPC cidPC sid
In DepthDetails US Patent
TargetAmine oxidase [flavin-containing] A(Homo sapiens (Human))
Shanghai Institute Of Material Medica, Chinese Academy Of Sciences
US Patent
LigandPNGBDBM472884(N-((4-fluoro-1-methylpiperidin-4-yl) methyl)-trans...)
Affinity DataIC50: >1.00E+5nM. Assay description: Screening method: Monoamine oxidase MAOA and MAOB activity screeningInstrument: microplate reader Envision™ (PerkinElmer, USA).MATERIALS: Human recom...
Ligand InfoPC cidPC sid
In DepthDetails US Patent