BDBM472902 4-((4-(((4-Fluoro-4-(((trans-2- phenylcyclopropyl)amino)methyl) piperidine-1-carbonyl)oxo)methyl) piperdin-1-yl)methyl)benzoic acid::US10836743, Compound A91
SMILES OC(=O)c1ccc(CN2CCC(COC(=O)N3CCC(F)(CNC4CC4c4ccccc4)CC3)CC2)cc1
InChI Key InChIKey=HAGOSHXFAQXFKB-UHFFFAOYSA-N
Data  1 IC50
  Tab Delimited (TSV)   2D SDfile   Computed 3D by Vconf -m prep SDfile
Find this compound or compounds like it in BindingDB:
Activity Spreadsheet -- Enzyme Inhibition Constant Data from BindingDB
Found 1 hit for monomerid = 472902
TargetLysine-specific histone demethylase 1A(Homo sapiens (Human))
Shanghai Institute Of Material Medica, Chinese Academy Of Sciences
US Patent
LigandPNGBDBM472902(4-((4-(((4-Fluoro-4-(((trans-2- phenylcyclopropyl)...)
Affinity DataIC50:  384nM. Assay description: Screening method: lysine-specific demethylase 1 (LSD1) activity screeningInstrument: microplate reader Envision™ (PerkinElmer, USA).MATERIALS: Human ...
Ligand InfoPC cidPC sid
In DepthDetails US Patent