BDBM472948 (R)-4-(2-fluorobenzyl)-6,6a,7,8,9,10-hexahydro- 5H-pyrazino[1,2-a][1,8]naphthyridine::US10836764, Compound 116
SMILES Fc1ccccc1Cc1ccnc2N3CCNC[C@H]3CCc12
InChI Key InChIKey=DVGKKRBHJDLRAB-OAHLLOKOSA-N
Data  3 KI
  Tab Delimited (TSV)   2D SDfile   Computed 3D by Vconf -m prep SDfile
Find this compound or compounds like it in BindingDB:
Activity Spreadsheet -- Enzyme Inhibition Constant Data from BindingDB
Found 3 hits for monomerid = 472948
Target5-hydroxytryptamine receptor 2A(Homo sapiens (Human))
Arena Pharmaceuticals
US Patent
LigandPNGBDBM472948((R)-4-(2-fluorobenzyl)-6,6a,7,8,9,10-hexahydro- 5H...)
Affinity DataKi:  2.65nM. Assay description: Radioligand binding assays were performed using the commercially available 5-HT2 receptor agonist [125I]DOI as the radioligand and nonspecific bindin...
Ligand InfoPC cidPC sid
In DepthDetails US Patent
Target5-hydroxytryptamine receptor 2B(Homo sapiens (Human))
Arena Pharmaceuticals
US Patent
LigandPNGBDBM472948((R)-4-(2-fluorobenzyl)-6,6a,7,8,9,10-hexahydro- 5H...)
Affinity DataKi:  35.6nM. Assay description: Radioligand binding assays were performed using the commercially available 5-HT2 receptor agonist [125I]DOI as the radioligand and nonspecific bindin...
Ligand InfoPC cidPC sid
In DepthDetails US Patent
Target5-hydroxytryptamine receptor 2C(Homo sapiens (Human))
Arena Pharmaceuticals
US Patent
LigandPNGBDBM472948((R)-4-(2-fluorobenzyl)-6,6a,7,8,9,10-hexahydro- 5H...)
Affinity DataKi:  304nM. Assay description: Radioligand binding assays were performed using the commercially available 5-HT2 receptor agonist [125I]DOI as the radioligand and nonspecific bindin...
Ligand InfoPC cidPC sid
In DepthDetails US Patent