BDBM472950 US10836758, Example 39
SMILES Fc1cc(NCCC2CCCO2)c(Cl)cc1S(=O)(=O)Nc1nccs1
InChI Key InChIKey=JWWCQDPYDSJTKX-UHFFFAOYSA-N
Data  1 IC50
  Tab Delimited (TSV)   2D SDfile   Computed 3D by Vconf -m prep SDfile
Find this compound or compounds like it in BindingDB:
Activity Spreadsheet -- Enzyme Inhibition Constant Data from BindingDB
Found 1 hit for monomerid = 472950
TargetSodium channel protein type 9 subunit alpha(Homo sapiens (Human))
Bristol-Myers Squibb
US Patent
LigandPNGBDBM472950(US10836758, Example 39)
Affinity DataIC50:  221nM. Assay description: hNaV1.7 binding affinities were determined with a filtration binding assay using purified membranes from HEK293 cells stably expressing hNaV1.7. HEK2...
Ligand InfoPC cidPC sid
In DepthDetails US Patent