BDBM472966 US10836758, Example 55
SMILES NC1CCC(CCNc2cc(F)c(cc2Cl)S(=O)(=O)Nc2nccs2)(CC1)c1ccccc1
InChI Key InChIKey=ANLVMSBBWJNZSY-UHFFFAOYSA-N
Data  1 IC50
  Tab Delimited (TSV)   2D SDfile   Computed 3D by Vconf -m prep SDfile
Find this compound or compounds like it in BindingDB:
Activity Spreadsheet -- Enzyme Inhibition Constant Data from BindingDB
Found 1 hit for monomerid = 472966
TargetSodium channel protein type 9 subunit alpha(Homo sapiens (Human))
Bristol-Myers Squibb
US Patent
LigandPNGBDBM472966(US10836758, Example 55)
Affinity DataIC50:  164nM. Assay description: hNaV1.7 binding affinities were determined with a filtration binding assay using purified membranes from HEK293 cells stably expressing hNaV1.7. HEK2...
Ligand InfoPC cidPC sid
In DepthDetails US Patent