BDBM473042 US10836769, Example 28
SMILES CNC(=O)C1(CC(F)(F)C1)NC(=O)C(=O)c1c(C)c(C(=O)Nc2ccc(F)c(c2)C#N)c2CCCn12
InChI Key InChIKey=WKNMRGXVCVCANO-UHFFFAOYSA-N
Data  1 EC50
  Tab Delimited (TSV)   2D SDfile   Computed 3D by Vconf -m prep SDfile
Find this compound or compounds like it in BindingDB:
Activity Spreadsheet -- Enzyme Inhibition Constant Data from BindingDB
Found 1 hit for monomerid = 473042
TargetCapsid protein(Hepatitis B virus genotype C subtype ayr (isolate ...)
Gilead Sciences
US Patent
LigandPNGBDBM473042(US10836769, Example 28)
Affinity DataEC50:  294nM. Assay description: A HepG2 cell line overexpressing the HBV virus attachment receptor sodium-taurocholate cotransporting polypeptide (NTCP) was grown to confluency in D...
Ligand InfoPC cidPC sid
In DepthDetails US Patent