BDBM473076 6-{8-[(5,6- dimethoxypyridin-2- yl)amino]imidazo[1,2- a]pyridin-6-yl}-1H- indazol-3-amine::US10842803, Structure TABLE 1.6
SMILES COc1ccc(Nc2cc(cn3ccnc23)-c2ccc3c(N)n[nH]c3c2)nc1OC
InChI Key InChIKey=AWKDVPHOKZABMA-UHFFFAOYSA-N
Data  1 IC50
  Tab Delimited (TSV)   2D SDfile   Computed 3D by Vconf -m prep SDfile
Find this compound or compounds like it in BindingDB:
Activity Spreadsheet -- Enzyme Inhibition Constant Data from BindingDB
Found 1 hit for monomerid = 473076
TargetTyrosine-protein kinase SYK(Homo sapiens (Human))
Kronos Bio
US Patent
LigandPNGBDBM473076(6-{8-[(5,6- dimethoxypyridin-2- yl)amino]imidazo[1...)
Affinity DataIC50:  1.33E+4nM. Assay description: A master mix minus Syk enzyme is prepared containing 1X Cell Signaling kinase buffer (25 mM Tris-HCl, pH 7.5, 5 mM beta-glycerophosphate, 2 mM dithio...
Ligand InfoPC cidPC sid
In DepthDetails US Patent