BDBM473089 2-[(6-{[6-(1H-indazol-6- yl)imidazo[1,2- a]pyridin-8- yl]amino}pyridin-3- yl)(methyl)amino]ethan- 1-ol::US10842803, Structure TABLE 1.19
SMILES CN(CCO)c1ccc(Nc2cc(cn3ccnc23)-c2ccc3cn[nH]c3c2)nc1
InChI Key InChIKey=YDGRJFSMYHPEQA-UHFFFAOYSA-N
Data  1 IC50
  Tab Delimited (TSV)   2D SDfile   Computed 3D by Vconf -m prep SDfile
Find this compound or compounds like it in BindingDB:
Activity Spreadsheet -- Enzyme Inhibition Constant Data from BindingDB
Found 1 hit for monomerid = 473089
TargetTyrosine-protein kinase SYK(Homo sapiens (Human))
Kronos Bio
US Patent
LigandPNGBDBM473089(2-[(6-{[6-(1H-indazol-6- yl)imidazo[1,2- a]pyridin...)
Affinity DataIC50:  9.00E+3nM. Assay description: A master mix minus Syk enzyme is prepared containing 1X Cell Signaling kinase buffer (25 mM Tris-HCl, pH 7.5, 5 mM beta-glycerophosphate, 2 mM dithio...
Ligand InfoPC cidPC sid
In DepthDetails US Patent