BDBM473093 1-ethyl-N-[6-(1H- indazol-6- yl)imidazo[1,2- a]pyridin-8-yl]-5- methyl-1H-pyrazol-3- amine::US10842803, Structure TABLE 1.23
SMILES CCn1nc(Nc2cc(cn3ccnc23)-c2ccc3cn[nH]c3c2)cc1C
InChI Key InChIKey=XMUVBXMTSPNLPS-UHFFFAOYSA-N
Data  1 IC50
  Tab Delimited (TSV)   2D SDfile   Computed 3D by Vconf -m prep SDfile
Find this compound or compounds like it in BindingDB:
Activity Spreadsheet -- Enzyme Inhibition Constant Data from BindingDB
Found 1 hit for monomerid = 473093
TargetTyrosine-protein kinase SYK(Homo sapiens (Human))
Kronos Bio
US Patent
LigandPNGBDBM473093(1-ethyl-N-[6-(1H- indazol-6- yl)imidazo[1,2- a]pyr...)
Affinity DataIC50:  3.90E+4nM. Assay description: A master mix minus Syk enzyme is prepared containing 1X Cell Signaling kinase buffer (25 mM Tris-HCl, pH 7.5, 5 mM beta-glycerophosphate, 2 mM dithio...
Ligand InfoPC cidPC sid
In DepthDetails US Patent