BDBM473111 2-{5-methyl-3-[(6-{1H- pyrrolo[3,2-b]pyridin-6- yl}imidazo[1,2- a]pyridin-8-yl)amino]- 1H-pyrazol-1-yl}ethan- 1-ol::US10842803, Structure TABLE 1.41
SMILES Cc1cc(Nc2cc(cn3ccnc23)-c2cnc3cc[nH]c3c2)nn1CCO
InChI Key InChIKey=QWHKXQBDXJJCHD-UHFFFAOYSA-N
Data  1 IC50
  Tab Delimited (TSV)   2D SDfile   Computed 3D by Vconf -m prep SDfile
Find this compound or compounds like it in BindingDB:
Activity Spreadsheet -- Enzyme Inhibition Constant Data from BindingDB
Found 1 hit for monomerid = 473111
TargetTyrosine-protein kinase SYK(Homo sapiens (Human))
Kronos Bio
US Patent
LigandPNGBDBM473111(2-{5-methyl-3-[(6-{1H- pyrrolo[3,2-b]pyridin-6- yl...)
Affinity DataIC50:  5.40E+4nM. Assay description: A master mix minus Syk enzyme is prepared containing 1X Cell Signaling kinase buffer (25 mM Tris-HCl, pH 7.5, 5 mM beta-glycerophosphate, 2 mM dithio...
Ligand InfoPC cidPC sid
In DepthDetails US Patent