BDBM473123 N-(5-methyl-6-(1H- pyrrolo[3,2-b]pyridin-6- yl)imidazo[1,2- a]pyridin-8-yl)-6,7- dihydro-4H- pyrazolo[5,1- c][1,4]oxazin-2-amine::US10842803, Structure TABLE 1.53
SMILES Cc1c(cc(Nc2cc3COCCn3n2)c2nccn12)-c1cnc2cc[nH]c2c1
InChI Key InChIKey=HZTAVSLVUIIUGL-UHFFFAOYSA-N
Data  1 IC50
  Tab Delimited (TSV)   2D SDfile   Computed 3D by Vconf -m prep SDfile
Find this compound or compounds like it in BindingDB:
Activity Spreadsheet -- Enzyme Inhibition Constant Data from BindingDB
Found 1 hit for monomerid = 473123
TargetTyrosine-protein kinase SYK(Homo sapiens (Human))
Kronos Bio
US Patent
LigandPNGBDBM473123(N-(5-methyl-6-(1H- pyrrolo[3,2-b]pyridin-6- yl)imi...)
Affinity DataIC50:  7.70E+3nM. Assay description: A master mix minus Syk enzyme is prepared containing 1X Cell Signaling kinase buffer (25 mM Tris-HCl, pH 7.5, 5 mM beta-glycerophosphate, 2 mM dithio...
Ligand InfoPC cidPC sid
In DepthDetails US Patent