BDBM473393 US10844044, Example 232
SMILES Cc1cc(ccc1F)[C@@H](NC(=O)c1cc(Cn2ccoc2=N)cc(c1)-c1ccc(F)cc1C)C1CC1
InChI Key InChIKey=UQVLZOSFEYYOPD-MHZLTWQESA-N
Data  1 KI
  Tab Delimited (TSV)   2D SDfile   Computed 3D by Vconf -m prep SDfile
Find this compound or compounds like it in BindingDB:
Activity Spreadsheet -- Enzyme Inhibition Constant Data from BindingDB
Found 1 hit for monomerid = 473393
TargetWD repeat-containing protein 5(Homo sapiens (Human))
Vanderbilt University
US Patent
LigandPNGBDBM473393(US10844044, Example 232)
Affinity DataKi:  0.0600nM. Assay description: A Time-Resolved Fluorescence Resonance Energy Transfer (TR-FRET) assay that measures the displacement of the 10mer-Thr-FAM probe in response to compo...
Ligand InfoPC cidPC sid
In DepthDetails US Patent