BDBM473478 US10844044, Example 253
SMILES Cc1cc(ccc1F)[C@@H](NC(=O)c1cc(CN2CCOC2=N)cc(c1)-c1cccnc1C(F)(F)F)C1CC1
InChI Key InChIKey=LIHADAJRNWQKGW-DEOSSOPVSA-N
Data  1 KI
  Tab Delimited (TSV)   2D SDfile   Computed 3D by Vconf -m prep SDfile
Find this compound or compounds like it in BindingDB:
Activity Spreadsheet -- Enzyme Inhibition Constant Data from BindingDB
Found 1 hit for monomerid = 473478
TargetWD repeat-containing protein 5(Homo sapiens (Human))
Vanderbilt University
US Patent
LigandPNGBDBM473478(US10844044, Example 253)
Affinity DataKi: <0.100nM. Assay description: A Time-Resolved Fluorescence Resonance Energy Transfer (TR-FRET) assay that measures the displacement of the 10mer-Thr-FAM probe in response to compo...
Ligand InfoPC cidPC sid
In DepthDetails US Patent