BDBM473565 US10844062, Example 6
SMILES Fc1ccc(NC(=O)c2ccco2)c(F)c1Nc1ncccc1-c1ncnc2[nH]cnc12
InChI Key InChIKey=NKJWFVJVPOMJNG-UHFFFAOYSA-N
Data  1 IC50
  Tab Delimited (TSV)   2D SDfile   Computed 3D by Vconf -m prep SDfile
Find this compound or compounds like it in BindingDB:
Activity Spreadsheet -- Enzyme Inhibition Constant Data from BindingDB
Found 1 hit for monomerid = 473565
TargetVascular endothelial growth factor receptor 2(Homo sapiens (Human))
Incheon University Industry Academic Cooperation Foundation
US Patent
LigandPNGBDBM473565(US10844062, Example 6)
Affinity DataIC50:  2.55E+3nM. Assay description: The inhibitory activities of the compounds of the present invention against VEGFR-2 tyrosine kinase were analyzed using ADP-Glo™ kinase assay kit com...
Ligand InfoPC cidPC sid
In DepthDetails US Patent