BDBM473622 US10844062, Example 58
SMILES Fc1ccc(NC(=O)c2cc(cc(c2)C(F)(F)F)C(F)(F)F)c(F)c1Nc1ncccc1-c1ncnc2[nH]cnc12
InChI Key InChIKey=APYOUKUTOJOTPZ-UHFFFAOYSA-N
Data  1 IC50
  Tab Delimited (TSV)   2D SDfile   Computed 3D by Vconf -m prep SDfile
Find this compound or compounds like it in BindingDB:
Activity Spreadsheet -- Enzyme Inhibition Constant Data from BindingDB
Found 1 hit for monomerid = 473622
TargetVascular endothelial growth factor receptor 2(Homo sapiens (Human))
Incheon University Industry Academic Cooperation Foundation
US Patent
LigandPNGBDBM473622(US10844062, Example 58)
Affinity DataIC50:  1.10E+4nM. Assay description: The inhibitory activities of the compounds of the present invention against VEGFR-2 tyrosine kinase were analyzed using ADP-Glo™ kinase assay kit com...
Ligand InfoPC cidPC sid
In DepthDetails US Patent