BDBM47373 2-methoxy-N-(2-morpholinophenyl)-5-(phthalimidomethyl)benzamide::5-[(1,3-dioxo-2-isoindolyl)methyl]-2-methoxy-N-[2-(4-morpholinyl)phenyl]benzamide::5-[(1,3-dioxoisoindol-2-yl)methyl]-2-methoxy-N-(2-morpholin-4-ylphenyl)benzamide::5-[[1,3-bis(oxidanylidene)isoindol-2-yl]methyl]-2-methoxy-N-(2-morpholin-4-ylphenyl)benzamide::UNM000011096401::cid_2110726
SMILES COc1ccc(CN2C(=O)c3ccccc3C2=O)cc1C(=O)Nc1ccccc1N1CCOCC1
InChI Key InChIKey=OFUSYHKQYUTAKZ-UHFFFAOYSA-N
Data  1 IC50  1 EC50
  Tab Delimited (TSV)   2D SDfile   Computed 3D by Vconf -m prep SDfile
Find this compound or compounds like it in BindingDB:
Activity Spreadsheet -- Enzyme Inhibition Constant Data from BindingDB
Found 2 hits for monomerid = 47373
TargetNeuropilin-1(Homo sapiens (Human))
Burnham Center For Chemical Genomics
Curated by PubChem BioAssay
LigandPNGBDBM47373(2-methoxy-N-(2-morpholinophenyl)-5-(phthalimidomet...)
Affinity DataIC50: >9.50E+4nM
In DepthDetails PCBioAssay
LigandPNGBDBM47373(2-methoxy-N-(2-morpholinophenyl)-5-(phthalimidomet...)
Affinity DataEC50:  340nM. Assay description: University of New Mexico Assay Overview: Assay Support:1R03MH081228-01A1 High-throughput multiplex screening for ABC transporter inhibitors PI: Rich...
In DepthDetails PCBioAssay