BDBM473901 3-(4-Chloro-phenyl)-6,6- dimethyl-3,5,6,7-tetrahydro- benzoimidazol-4-one::US10858342, Compound C-ABN
SMILES CC1(C)Cc2ncn(c2C(=O)C1)-c1ccc(Cl)cc1
InChI Key InChIKey=AOMOKIUCMYWTLV-UHFFFAOYSA-N
Data  2 IC50
  Tab Delimited (TSV)   2D SDfile   Computed 3D by Vconf -m prep SDfile
Find this compound or compounds like it in BindingDB:
Activity Spreadsheet -- Enzyme Inhibition Constant Data from BindingDB
Found 2 hits for monomerid = 473901
TargetCytochrome P450 11B1, mitochondrial(Homo sapiens (Human))
Boehringer Ingelheim International
US Patent
LigandPNGBDBM473901(3-(4-Chloro-phenyl)-6,6- dimethyl-3,5,6,7-tetrahyd...)
Affinity DataIC50:  1.00E+6nM. Assay description: Assays are performed as for aldosterone synthase except for the use of 150 units of CYP11B1, 11-deoxycortisol as substrate and cortisol measured as p...
Ligand InfoPC cidPC sid
In DepthDetails US Patent
TargetCytochrome P450 11B2, mitochondrial(Homo sapiens (Human))
Boehringer Ingelheim International
US Patent
LigandPNGBDBM473901(3-(4-Chloro-phenyl)-6,6- dimethyl-3,5,6,7-tetrahyd...)
Affinity DataIC50:  15nM. Assay description: Assays are performed in 96-well format in a final volume of 60 microL/well, containing 100 mM potassium phosphate, pH 7.4, 1% (v/v) DMSO, and additio...
Ligand InfoPC cidPC sid
In DepthDetails US Patent