BDBM47395 1-keto-7,8-dimethoxy-isothiochromene-3-carboxylic acid isopropyl ester::7,8-dimethoxy-1-oxo-2-benzothiopyran-3-carboxylic acid propan-2-yl ester::UNM000011100201::cid_699975::propan-2-yl 7,8-dimethoxy-1-oxidanylidene-isothiochromene-3-carboxylate::propan-2-yl 7,8-dimethoxy-1-oxoisothiochromene-3-carboxylate
SMILES COc1ccc2cc(sc(=O)c2c1OC)C(=O)OC(C)C
InChI Key InChIKey=NIZDVLBOZYTKHU-UHFFFAOYSA-N
Data  1 EC50
  Tab Delimited (TSV)   2D SDfile   Computed 3D by Vconf -m prep SDfile
Find this compound or compounds like it in BindingDB:
Activity Spreadsheet -- Enzyme Inhibition Constant Data from BindingDB
Found 1 hit for monomerid = 47395
LigandPNGBDBM47395(1-keto-7,8-dimethoxy-isothiochromene-3-carboxylic ...)
Affinity DataEC50:  2.44E+4nM. Assay description: University of New Mexico Assay Overview: Assay Support:1R03MH081228-01A1 High-throughput multiplex screening for ABC transporter inhibitors PI: Rich...
In DepthDetails PCBioAssay