BDBM47401 2-methyl-7,8-bis(oxidanyl)-3-(1-phenylpyrazol-4-yl)chromen-4-one::7,8-dihydroxy-2-methyl-3-(1-phenyl-4-pyrazolyl)-1-benzopyran-4-one::7,8-dihydroxy-2-methyl-3-(1-phenylpyrazol-4-yl)chromen-4-one::7,8-dihydroxy-2-methyl-3-(1-phenylpyrazol-4-yl)chromone::MLS000111828::SMR000107747::cid_5310850
SMILES Cc1oc2c(O)c(O)ccc2c(=O)c1-c1cnn(c1)-c1ccccc1
InChI Key InChIKey=ZVWHFHQBQHDONN-UHFFFAOYSA-N
Data  1 IC50
  Tab Delimited (TSV)   2D SDfile   Computed 3D by Vconf -m prep SDfile
Find this compound or compounds like it in BindingDB:
Activity Spreadsheet -- Enzyme Inhibition Constant Data from BindingDB
Found 1 hit for monomerid = 47401
TargetTyrosine-protein kinase JAK2(Homo sapiens (Human))
The Scripps Research Institute Molecular Screening Center
Curated by PubChem BioAssay
LigandPNGBDBM47401(2-methyl-7,8-bis(oxidanyl)-3-(1-phenylpyrazol-4-yl...)
Affinity DataIC50:  2.97E+3nM. Assay description: Source (MLPCN Center Name): The Scripps Research Institute Molecular Screening Center (SRIMSC) Center Affiliation: The Scripps Research Institute (TS...
In DepthDetails PCBioAssay