BDBM474124 7-(2-Fluorobenzyl)-6-methyl-3- (tetrahydro-2H-pyran-4- yl)imidazo[1,5-a]pyrazin-8(7H)- one::US10858362, Example 17::US10912773, Example 17::US11472810, Example 17
SMILES Cc1cn2c(ncc2c(=O)n1Cc1ccccc1F)C1CCOCC1
InChI Key InChIKey=SGDZBPUOHUWTHZ-UHFFFAOYSA-N
Data  12 IC50
  Tab Delimited (TSV)   2D SDfile   Computed 3D by Vconf -m prep SDfile
Find this compound or compounds like it in BindingDB:
Activity Spreadsheet -- Enzyme Inhibition Constant Data from BindingDB
Found 12 hits for monomerid = 474124
LigandPNGBDBM474124(7-(2-Fluorobenzyl)-6-methyl-3- (tetrahydro-2H-pyra...)
Affinity DataIC50:  42nM. Assay description: PDE1A, PDE1B and PDE1C assays were performed as follows: the assays was performed in 60 μL samples containing a fixed amount of the PDE1 enzyme ...
Ligand InfoPC cidPC sid
In DepthDetails US Patent
LigandPNGBDBM474124(7-(2-Fluorobenzyl)-6-methyl-3- (tetrahydro-2H-pyra...)
Affinity DataIC50:  36nM. Assay description: PDE1A, PDE1B and PDE1C assays were performed as follows: the assays was performed in 60 μL samples containing a fixed amount of the PDE1 enzyme ...
Ligand InfoPC cidPC sid
In DepthDetails US Patent
LigandPNGBDBM474124(7-(2-Fluorobenzyl)-6-methyl-3- (tetrahydro-2H-pyra...)
Affinity DataIC50:  9nM. Assay description: PDE1A, PDE1B and PDE1C assays were performed as follows: the assays was performed in 60 μL samples containing a fixed amount of the PDE1 enzyme ...
Ligand InfoPC cidPC sid
In DepthDetails US Patent
LigandPNGBDBM474124(7-(2-Fluorobenzyl)-6-methyl-3- (tetrahydro-2H-pyra...)
Affinity DataIC50:  42nM. Assay description: PDE1A, PDE1B and PDE1C assays were performed as follows: the assays was performed in 60 μL samples containing a fixed amount of the PDE1 enzyme ...
Ligand InfoPC cidPC sid
In DepthDetails US Patent
LigandPNGBDBM474124(7-(2-Fluorobenzyl)-6-methyl-3- (tetrahydro-2H-pyra...)
Affinity DataIC50:  36nM. Assay description: PDE1A, PDE1B and PDE1C assays were performed as follows: the assays was performed in 60 μL samples containing a fixed amount of the PDE1 enzyme ...
Ligand InfoPC cidPC sid
In DepthDetails US Patent
LigandPNGBDBM474124(7-(2-Fluorobenzyl)-6-methyl-3- (tetrahydro-2H-pyra...)
Affinity DataIC50:  9nM
Ligand InfoPC cidPC sid
In DepthDetails US Patent
LigandPNGBDBM474124(7-(2-Fluorobenzyl)-6-methyl-3- (tetrahydro-2H-pyra...)
Affinity DataIC50:  42nM. Assay description: PDE1A, PDE1B and PDE1C assays were performed as follows: the assays were performed in 60 μL samples containing a fixed amount of the PDE1 enzyme...
Ligand InfoPC cidPC sid
In DepthDetails US Patent
LigandPNGBDBM474124(7-(2-Fluorobenzyl)-6-methyl-3- (tetrahydro-2H-pyra...)
Affinity DataIC50:  36nM. Assay description: PDE1A, PDE1B and PDE1C assays were performed as follows: the assays were performed in 60 μL samples containing a fixed amount of the PDE1 enzyme...
Ligand InfoPC cidPC sid
In DepthDetails US Patent
LigandPNGBDBM474124(7-(2-Fluorobenzyl)-6-methyl-3- (tetrahydro-2H-pyra...)
Affinity DataIC50:  9nM. Assay description: PDE1A, PDE1B and PDE1C assays were performed as follows: the assays were performed in 60 μL samples containing a fixed amount of the PDE1 enzyme...
Ligand InfoPC cidPC sid
In DepthDetails US Patent
LigandPNGBDBM474124(7-(2-Fluorobenzyl)-6-methyl-3- (tetrahydro-2H-pyra...)
Affinity DataIC50:  42nM. Assay description: PDE1A, PDE1B and PDE1C assays were performed as follows: the assays was performed in 60 μL samples containing a fixed amount of the PDE1 enzym1 ...
Ligand InfoPC cidPC sid
In DepthDetails US Patent
LigandPNGBDBM474124(7-(2-Fluorobenzyl)-6-methyl-3- (tetrahydro-2H-pyra...)
Affinity DataIC50:  36nM
Ligand InfoPC cidPC sid
In DepthDetails US Patent
LigandPNGBDBM474124(7-(2-Fluorobenzyl)-6-methyl-3- (tetrahydro-2H-pyra...)
Affinity DataIC50:  9nM. Assay description: PDE1A, PDE1B and PDE1C assays were performed as follows: the assays was performed in 60 μL samples containing a fixed amount of the PDE1 enzyme ...
Ligand InfoPC cidPC sid
In DepthDetails US Patent